trans-bis-(1-Propenyl) disulfide

Normal alkane RI, non-polar column, temperature ramp

Data compiled by: NIST Mass Spectrometry Data Center, William E. Wallace, director

Column type Capillary
Active phase DB-5MS
Column length (m) 30.
Carrier gas He
Substrate
Column diameter (mm) 0.25
Phase thickness (μm) 0.25
Tstart (C) 60.
Tend (C) 270.
Heat rate (K/min) 3.
Initial hold (min)
Final hold (min)
I 1102.
ReferenceZoghbi, Andrade, et al., 2002
Comment MSDC-RI

References

Zoghbi, Andrade, et al., 2002
Zoghbi, M.G.B.; Andrade, E.H.A.; Maia, J.G.S., Volatile constituents from Adenocalymma alliaceum Miers and Petiveria alliacea L., two medicinal herbs of the Amazon, Flavour Fragr. J., 2002, 17, 2, 133-135, https://doi.org/10.1002/ffj.1051 . [all data]