2-tricosene (Z)

Van Den Dool and Kratz RI, non-polar column, custom temperature program

View large format table.

Column type Active phase I Reference Comment
CapillaryDB-52325.Zaikin and Borisov, 2002He; Column length: 30. m; Column diameter: 0.25 mm; Program: 30C => 5K/min=120C => 10C/min => 270C

References

Zaikin and Borisov, 2002
Zaikin, V.G.; Borisov, R.S., Chromatographic-mass spectrometric analysis of Fishcer-Tropsch synthesis products, J. Anal. Chem. USSR (Engl. Transl.), 2002, 57, 6, 544-551. [all data]