13-Tigloyloxy-17-oxolupanine

Normal alkane RI, non-polar column, temperature ramp

View large format table.

Column type Active phase I Reference Comment
CapillaryDB-12971.Torres, Quintos, et al., 200230. m/0.25 mm/0.25 μm, He, 120. C @ 3. min, 10. K/min, 260. C @ 10. min

Normal alkane RI, non-polar column, custom temperature program

View large format table.

Column type Active phase I Reference Comment
CapillaryDB-12905.Wink, Meissner, et al., 1995Column length: 30. m; Column diameter: 0.3 mm; Program: not specified

References

Torres, Quintos, et al., 2002
Torres, K.B.; Quintos, N.R.; Necha, L.L.B.; Wink, M., Alkaloid profile of leaves and seeds of Lupinus hintonii C.P. Smith, Z. Naturforsch., 2002, 57c, 243-247. [all data]

Wink, Meissner, et al., 1995
Wink, M.; Meissner, C.; Witte, L., Patterns of quinolizidine alkaloids in 56 species of the genus Lupinus, Phytochemistry, 1995, 38, 1, 139-153, https://doi.org/10.1016/0031-9422(95)91890-D . [all data]