Methyl 8,15-Isopimaradien-18-oate

Van Den Dool and Kratz RI, non-polar column, temperature ramp

View large format table.

Column type Active phase I Reference Comment
CapillarySE-302158.Mayr, Lorbeer, et al., 198225. m/0.28 mm/0.15 μm, H2, 4. K/min; Tstart: 140. C; Tend: 280. C

References

Mayr, Lorbeer, et al., 1982
Mayr, M.; Lorbeer, E.; Kratzl, K., Gas chromatographic separation of diterpene acids on glass capillary columns of different polarity, J. Amer. Oil Chem. Soc., 1982, 59, 1, 52-57, https://doi.org/10.1007/BF02670069 . [all data]