α-Humulene epoxide II

Van Den Dool and Kratz RI, non-polar column, temperature ramp

Data compiled by: NIST Mass Spectrometry Data Center, William E. Wallace, director

Column type CapillaryCapillary
Active phase HP-5CP Sil 5 CB
Column length (m) 30.25.
Carrier gas HeN2
Substrate
Column diameter (mm) 0.250.25
Phase thickness (μm) 0.250.25
Tstart (C) 50.60.
Tend (C) 250.280.
Heat rate (K/min) 4.4.
Initial hold (min) 4.6.
Final hold (min) 10.
I 1606.1595.
ReferenceQuijano, Salamanca, et al., 2007Pino, Marbot, et al., 2002
Comment MSDC-RI MSDC-RI

References

Quijano, Salamanca, et al., 2007
Quijano, C.E.; Salamanca, G.; Pino, J.A., Aroma volatile constituents of Colombian varieties of mango (Mangifera indica L.), Flavour Fragr. J., 2007, 22, 5, 401-406, https://doi.org/10.1002/ffj.1812 . [all data]

Pino, Marbot, et al., 2002
Pino, J.A.; Marbot, R.; Quert, R.; García, H., Study of essential oils of Eucalyptus resinifera Smith, E. tereticornis Smith and Corymbia maculata (Hook.) K.D. Hill L.A.S. Johnson, grown in Cuba, Flavour Fragr. J., 2002, 17, 1, 1-4, https://doi.org/10.1002/ffj.1026 . [all data]