OH GA12-like, methyl ester TMS ether

Van Den Dool and Kratz RI, non-polar column, custom temperature program

View large format table.

Column type Active phase I Reference Comment
CapillaryCP Sil 5 CB2556.Blake, Taylor, et al., 200225. m/0.25 mm/0.25 μm, He; Program: 60C (1min) => 20C/min => 170C => 4C/min => 290C
CapillaryHP-12588.Pearce, Hutt, et al., 2002Column length: 12. m; Column diameter: 0.22 mm; Program: 60C(0.5min) => 20C/min => 200C => 5C/min => 300C
CapillaryDB-52584.Pearce, Hutt, et al., 2002Column length: 15. m; Column diameter: 0.25 mm; Program: 60C(0.5min) => 20C/min => 200C => 5C/min => 300C

References

Blake, Taylor, et al., 2002
Blake, P.S.; Taylor, J.M.; Finch-Savage, W.E., Identification of abscisic acid, indole-3-acetic acid, jasmonic acid, indole-3-acetonitrile, methyl jasmonate and gibberellins in developing, dormant and startified seeds of ash (Fraxinus excelsior), Plant Growth Regul., 2002, 37, 2, 119-125, https://doi.org/10.1023/A:1020504610172 . [all data]

Pearce, Hutt, et al., 2002
Pearce, D.W.; Hutt, O.E.; Rood, S.B.; Mander, L.N., Gibberellins in shoots and developing capsules of Populus species, Phytochemistry, 2002, 59, 6, 679-687, https://doi.org/10.1016/S0031-9422(02)00009-2 . [all data]