p-Mentha-1,5,8-triene

Kovats' RI, polar column, isothermal

Data compiled by: NIST Mass Spectrometry Data Center, William E. Wallace, director

Column type Capillary
Active phase PEG-20M
Column length (m) 75.
Carrier gas
Substrate
Column diameter (mm) 0.25
Phase thickness (μm)
Temperature (C) 100.
I 1224.
ReferenceMorishita, Okano, et al., 1980
Comment MSDC-RI

Kovats' RI, non-polar column, temperature ramp

Data compiled by: NIST Mass Spectrometry Data Center, William E. Wallace, director

Column type CapillaryCapillaryCapillary
Active phase BP-1SE-30HP-5MS
Column length (m) 39.25.30.
Carrier gas HeHeHe
Substrate
Column diameter (mm) 0.250.220.32
Phase thickness (μm) 0.250.250.25
Tstart (C) 60.70.70.
Tend (C) 280.220.250.
Heat rate (K/min) 4.4.3.
Initial hold (min) 4. 5.
Final hold (min)
I 1127.1119.1108.
ReferenceAsghari, Sajjadi, et al., 2003Palá-Paúl, Velasco-Negueruela, et al., 2002Siani, Ramos, et al., 1999
Comment MSDC-RI MSDC-RI MSDC-RI

References

Morishita, Okano, et al., 1980
Morishita, F.; Okano, T.; Kojima, T., Retention indices of monocyclic monoterpene hydrocarbons, Bunseki Kagaku, 1980, 29, 1, 48-53, https://doi.org/10.2116/bunsekikagaku.29.48 . [all data]