trans-Bicyclogermacradiene

Normal alkane RI, non-polar column, temperature ramp

View large format table.

Column type Active phase I Reference Comment
CapillaryHP-51493.Lago, Reis, et al., 200230. m/0.32 mm/0.25 μm, 100. C @ 2. min, 5. K/min, 240. C @ 5. min

References

Lago, Reis, et al., 2002
Lago, J.H.G.; Reis, A.A.; Roque, N.F., Chemical composition from volatile oil of the stem bark of Guarea macrophylla Vahl. ssp. tuberculata Vellozo (Meliaceae), Flavour Fragr. J., 2002, 17, 4, 255-257, https://doi.org/10.1002/ffj.1091 . [all data]