cis-Bicyclogermacradiene

Normal alkane RI, non-polar column, temperature ramp

Data compiled by: NIST Mass Spectrometry Data Center, William E. Wallace, director

Column type Capillary
Active phase HP-5
Column length (m) 30.
Carrier gas
Substrate
Column diameter (mm) 0.32
Phase thickness (μm) 0.25
Tstart (C) 100.
Tend (C) 240.
Heat rate (K/min) 5.
Initial hold (min) 2.
Final hold (min) 5.
I 1461.
ReferenceLago, Reis, et al., 2002
Comment MSDC-RI

References

Lago, Reis, et al., 2002
Lago, J.H.G.; Reis, A.A.; Roque, N.F., Chemical composition from volatile oil of the stem bark of Guarea macrophylla Vahl. ssp. tuberculata Vellozo (Meliaceae), Flavour Fragr. J., 2002, 17, 4, 255-257, https://doi.org/10.1002/ffj.1091 . [all data]