Menthenyl acetate

Normal alkane RI, non-polar column, temperature ramp

Data compiled by: NIST Mass Spectrometry Data Center, William E. Wallace, director

Column type Capillary
Active phase OV-101
Column length (m) 25.
Carrier gas He
Substrate
Column diameter (mm) 0.32
Phase thickness (μm)
Tstart (C) 50.
Tend (C) 200.
Heat rate (K/min) 5.
Initial hold (min)
Final hold (min)
I 1364.
ReferenceKuiate, Bessière, et al., 2002
Comment MSDC-RI

References

Kuiate, Bessière, et al., 2002
Kuiate, J.-R.; Bessière, J.-M.; Zollo, P.-H.A., Composition of the essential oils from three Laggera Spp. from Cameroon, Flavour Fragr. J., 2002, 17, 2, 105-108, https://doi.org/10.1002/ffj.1057 . [all data]