7-epi-α-eudesmol

Van Den Dool and Kratz RI, non-polar column, temperature ramp

Data compiled by: NIST Mass Spectrometry Data Center, William E. Wallace, director

Column type CapillaryCapillaryCapillaryCapillaryCapillary
Active phase ZB-5DB-5RTX-1DB-5SPB-1
Column length (m) 30.30.60.30.30.
Carrier gas HeN2 HeHe
Substrate
Column diameter (mm) 0.250.320.220.250.25
Phase thickness (μm) 0.250.250.250.260.25
Tstart (C) 50.60.60.60.70.
Tend (C) 250.240.220.210.220.
Heat rate (K/min) 3.3.2.3.3.
Initial hold (min)  3.
Final hold (min)  5.20. 15.
I 1659.1651.1643.1653.1632.
ReferenceSimoniatto, Bonani, et al., 2007Dob, Dahmane, et al., 2006Cozzani, Muselli, et al., 2005Sati and Mathela, 2005Antunes, Sevinate-Pinto, et al., 2004
Comment MSDC-RI MSDC-RI MSDC-RI MSDC-RI MSDC-RI
Column type CapillaryCapillary
Active phase HP-5MSHP-5
Column length (m) 30.30.
Carrier gas  He
Substrate
Column diameter (mm) 0.250.25
Phase thickness (μm) 0.250.25
Tstart (C) 50.60.
Tend (C) 280.280.
Heat rate (K/min) 3.3.
Initial hold (min) 5.
Final hold (min)
I 1658.1641.
ReferenceDemetzos, Angelopoulou, et al., 2002Pitarokili, Couladis, et al., 2002
Comment MSDC-RI MSDC-RI

Normal alkane RI, non-polar column, temperature ramp

Data compiled by: NIST Mass Spectrometry Data Center, William E. Wallace, director

Column type CapillaryCapillaryCapillaryCapillaryCapillary
Active phase DB-5DB-5DB-5DB-5OV-101
Column length (m) 30.30.30.30.25.
Carrier gas HeHeH2HeHe
Substrate
Column diameter (mm) 0.250.250.250.250.32
Phase thickness (μm) 0.250.250.250.25
Tstart (C) 60.60.60.60.50.
Tend (C) 240.275.280.240.200.
Heat rate (K/min) 3.4.4.3.5.
Initial hold (min)  5.10.
Final hold (min)   40.
I 1655.1658.1658.1657.1698.
ReferenceTellez, Khan, et al., 2004Morteza-Semnani and Saeedi, 2003Pino, Marbot, et al., 2003Kobaisy, Tellez, et al., 2002Kuiate, Bessière, et al., 2002
Comment MSDC-RI MSDC-RI MSDC-RI MSDC-RI MSDC-RI
Column type Capillary
Active phase DB-5
Column length (m) 30.
Carrier gas He
Substrate
Column diameter (mm) 0.25
Phase thickness (μm) 0.25
Tstart (C) 60.
Tend (C) 240.
Heat rate (K/min) 3.
Initial hold (min)
Final hold (min)
I 1657.
ReferenceTellez, Dayan, et al., 2000
Comment MSDC-RI

Van Den Dool and Kratz RI, polar column, temperature ramp

Data compiled by: NIST Mass Spectrometry Data Center, William E. Wallace, director

Column type Capillary
Active phase RTX-Wax
Column length (m) 60.
Carrier gas
Substrate
Column diameter (mm) 0.22
Phase thickness (μm) 0.25
Tstart (C) 60.
Tend (C) 220.
Heat rate (K/min) 2.
Initial hold (min)
Final hold (min) 20.
I 2205.
ReferenceCozzani, Muselli, et al., 2005
Comment MSDC-RI

Kovats' RI, non-polar column, temperature ramp

Data compiled by: NIST Mass Spectrometry Data Center, William E. Wallace, director

Column type Capillary
Active phase DB-5
Column length (m)
Carrier gas
Substrate
Column diameter (mm)
Phase thickness (μm)
Tstart (C) 60.
Tend (C) 240.
Heat rate (K/min) 3.
Initial hold (min)
Final hold (min)
I 1658.
ReferenceShatar S., 2005
Comment MSDC-RI

Kovats' RI, non-polar column, custom temperature program

Data compiled by: NIST Mass Spectrometry Data Center, William E. Wallace, director

Column type Capillary
Active phase DB-5MS
Column length (m) 30.
Carrier gas He
Substrate
Column diameter (mm) 0.25
Phase thickness (μm) 0.25
Program 60C(5min) => 2C/min => 140C= 5C/min => 250C(5min)
I 1663.
ReferenceTuberoso, Kowalczyk, et al., 2005
Comment MSDC-RI

References

Simoniatto, Bonani, et al., 2007
Simoniatto, E.; Bonani, V.F.L.; Morel, A.F.; Poppi, N.R.; Raposo, J.L., Jr.; Stuker, C.Z.; Peruzzo, G.M.; Peres, M.T.L.P.; Hess, S.C., Chemical composition and evaluation of antibacterial and antioxidant activities of the essential oil of Croton urucurana Baillon (Euphorbiaceae) stem bark, J. Braz. Chem., 2007, 18, 5, 879-885, https://doi.org/10.1590/S0103-50532007000500002 . [all data]

Dob, Dahmane, et al., 2006
Dob, T.; Dahmane, D.; Chelghoum, C., Essential oil composition of Juniperus oxycedrus growing in Algeria, Pharm. Biol., 2006, 44, 1, 1-6, https://doi.org/10.1080/13880200500530922 . [all data]

Cozzani, Muselli, et al., 2005
Cozzani, S.; Muselli, A.; Desjobert, J.-M.; Bernardini, A.-F.; Tomi, F.; Casanova, J., Chemical composition of essential oil of Teucrium polium subsp. capitatum (L.) from Corsica, Flavour Fragr. J., 2005, 20, 4, 436-441, https://doi.org/10.1002/ffj.1463 . [all data]

Sati and Mathela, 2005
Sati, S.; Mathela, C.S., Essential oil composition of Valeriana hardwickii var. arnottiana from the Himalayas, Flavour Fragr. J., 2005, 20, 3, 299-301, https://doi.org/10.1002/ffj.1415 . [all data]

Antunes, Sevinate-Pinto, et al., 2004
Antunes, T.; Sevinate-Pinto, I.; Barroso, J.G.; Cavaleiro, C.; Salgueiro, L.R., Micromorphology of trichomes and composition of essential oil of Teucrium capitatum, Flavour Fragr. J., 2004, 19, 4, 336-340, https://doi.org/10.1002/ffj.1310 . [all data]

Demetzos, Angelopoulou, et al., 2002
Demetzos, C.; Angelopoulou, D.; Perdetzoglou, D., A comparative study of the essential oils of Cistus salviifolius in several populations of Crete (Greece), Biochem. Syst. Ecol., 2002, 30, 7, 651-665, https://doi.org/10.1016/S0305-1978(01)00145-4 . [all data]

Pitarokili, Couladis, et al., 2002
Pitarokili, D.; Couladis, M.; Petsikos-Panayotarou, N.; Tzakou, O., Composition and antifungal activity on soil-borne pathogens of the essential oil of Salvia sclarea from Greece, J. Agric. Food Chem., 2002, 50, 23, 6688-6691, https://doi.org/10.1021/jf020422n . [all data]