Nuciferyl acetate

Kovats' RI, non-polar column, custom temperature program

View large format table.

Column type Active phase I Reference Comment
CapillaryBP-11830.Khan, Srivastava, et al., 200325. m/0.25 mm/0.25 μm, N2; Program: 60C => 5C/min => 220C (5min) => 3C/min => 245 C (5min)
CapillaryBP-11830.Khan, Srivastava, et al., 200230. m/0.32 mm/0.25 μm, N2; Program: 60 C 5 C/min -> 220 C (5 min) 3 C/min -> 245 C (5 min)

References

Khan, Srivastava, et al., 2003
Khan, M.; Srivastava, S.K.; Jain, N.; Syamasundar, K.V.; Yadav, A.K., Chemical composition of fruit and stem essential oils of Lantana camara from northern India, Flavour Fragr. J., 2003, 18, 5, 376-379, https://doi.org/10.1002/ffj.1197 . [all data]

Khan, Srivastava, et al., 2002
Khan, M.; Srivastava, S.K.; Syamasundar, K.V.; Singh, M.; Naqvi, A.A., Chemical composition of leaf and flower essential oil of Lantana camara from India, Flavour Fragr. J., 2002, 17, 1, 75-77, https://doi.org/10.1002/ffj.1047 . [all data]