Octatriacontane, 5-methyl-

Normal alkane RI, non-polar column, custom temperature program

View large format table.

Column type Active phase I Reference Comment
CapillaryHP-53847.Juárez, Carlson, et al., 2002H2; Column length: 30. m; Column diameter: 0.32 mm; Program: 60C (2min) => 20C/min => 180C => 3C/min => 310 C (10min)

References

Juárez, Carlson, et al., 2002
Juárez, M.P.; Carlson, D.A.; Schettino, P.M.S.; Mijailovsky, S.; Rojas, G., Cuticular hydrocarbons of Chagas disease vectors in Mexico, Mem. Inst. Oswaldo Cruz., 2002, 97, 6, 819-827, https://doi.org/10.1590/S0074-02762002000600012 . [all data]