Longicamphenylone

Van Den Dool and Kratz RI, non-polar column, temperature ramp

Data compiled by: NIST Mass Spectrometry Data Center, William E. Wallace, director

Column type CapillaryCapillaryCapillaryCapillary
Active phase DB-5DB-5HP-5DB-5
Column length (m) 30.30.30.25.
Carrier gas He HeHe
Substrate
Column diameter (mm) 0.250.250.250.25
Phase thickness (μm) 0.250.250.25
Tstart (C) 50.60.60.70.
Tend (C) 250.220.240.275.
Heat rate (K/min) 3.3.3.4.
Initial hold (min)
Final hold (min) 10.
I 1569.1559.1561.1554.
ReferenceYu, Liao, et al., 2007Bastos, Ishimoto, et al., 2006Macchioni, Cioni, et al., 2003Javidnia, Miri, et al., 2002
Comment MSDC-RI MSDC-RI MSDC-RI MSDC-RI

References

Yu, Liao, et al., 2007
Yu, J.Q.; Liao, Z.X.; Cai, X.Q.; Lei, J.C.; Zou, G.L., Composition, antimicrobial activity and cytotoxicity of essential oils from Aristolochia mollissima, Environmental Toxicology and Pharmacology, 2007, 23, 2, 162-167, https://doi.org/10.1016/j.etap.2006.08.004 . [all data]

Bastos, Ishimoto, et al., 2006
Bastos, D.H.M.; Ishimoto, E.; Marques, M.O.M.; Ferri, A.F.; Torres, E.A.F.S., Essential oil and antioxidant activity of green mate and mate tea (Ilex paraguariensis) infusions, J. Food Comp. Anal., 2006, 19, 6-7, 538-543, https://doi.org/10.1016/j.jfca.2005.03.002 . [all data]

Macchioni, Cioni, et al., 2003
Macchioni, F.; Cioni, P.L.; Flamini, G.; Morelli, I.; Maccioni, S.; Ansaldi, M., Chemical composition of essential oils from needles, branches and cones of Pinus pinea, P. halepensis, P. pinaster and P. nigra from central Italy, Flavour Fragr. J., 2003, 18, 2, 139-143, https://doi.org/10.1002/ffj.1178 . [all data]

Javidnia, Miri, et al., 2002
Javidnia, K.; Miri, R.; Safavi, F.; Azarpira, A.; Shafiee, A., Composition of the essential oil of Nepeta persica Boiss from Iran, Flavour Fragr. J., 2002, 17, 1, 20-22, https://doi.org/10.1002/ffj.1023 . [all data]