(E)-7-Tridecen-2-yl acetate

Van Den Dool and Kratz RI, non-polar column, custom temperature program

View large format table.

Column type Active phase I Reference Comment
CapillaryDB-51618.Gries, Khaskin, et al., 200230. m/0.32 mm/0.25 μm; Program: not specified

Van Den Dool and Kratz RI, polar column, custom temperature program

View large format table.

Column type Active phase I Reference Comment
CapillarySP-10001894.Gries, Khaskin, et al., 200230. m/0.32 mm/0.25 μm; Program: not specified

References

Gries, Khaskin, et al., 2002
Gries, R.; Khaskin, G.; Gries, G.; Bennett, R.G.; King, G.G.S.; Morewood, P.; Slessor, K.N.; Morewood, W.D., (Z,Z)-4,7-trideadien-(S)-2-yl acetate: sex pheromone of douglas-fir cone gall midge, Contarinia oregonensis, J. Chem. Ecol., 2002, 28, 11, 2283-2297, https://doi.org/10.1023/A:1021005517389 . [all data]