5-ethylindene

Kovats' RI, non-polar column, isothermal

View large format table.

Column type Active phase Temperature (C) I Reference Comment
CapillarySqualane96.1203.6Macák, Nabivach, et al., 1982N2; Column length: 50. m; Column diameter: 0.25 mm
CapillarySqualane96.1203.6Nabivach, Bur'yan, et al., 1978Column length: 50. m; Column diameter: 0.25 mm

References

Macák, Nabivach, et al., 1982
Macák, J.; Nabivach, V.; Buryan, P.; Sindler, S., Dependence of retention indices of alkylbenzenes on their molecular structure, J. Chromatogr., 1982, 234, 2, 285-302, https://doi.org/10.1016/S0021-9673(00)81867-1 . [all data]

Nabivach, Bur'yan, et al., 1978
Nabivach, V.M.; Bur'yan, P.; Matsak, I., Retention indices of aromatic hydrocarbons on a squalane capillary column, Zh. Anal. Khim., 1978, 33, 7, 1108-1113. [all data]