cis-ene-yne-Dicycloether

Normal alkane RI, non-polar column, temperature ramp

View large format table.

Column type Active phase I Reference Comment
CapillaryDB-51808.Senatore, Rigano, et al., 200430. m/0.25 mm/0.25 μm, He, 40. C @ 5. min, 2. K/min, 250. C @ 20. min
CapillaryNB-301846.Raal, Arak, et al., 200350. m/0.2 mm/0.5 μm, He, 2. K/min; Tstart: 50. C; Tend: 250. C
CapillaryBP-11843.Das, Ram, et al., 200225. m/0.50 mm/0.25 μm, N2, 5. K/min, 220. C @ 10. min; Tstart: 60. C

Normal alkane RI, non-polar column, custom temperature program

View large format table.

Column type Active phase I Reference Comment
CapillaryOptima-5MS1802.HEuskin, Godin, et al., 200930. m/0.32 mm/0.25 μm, Helium; Program: 40 0C (5 min) 5 0C/min -> 230 0C 30 0C/min -> 280 0C (5 min)

References

Senatore, Rigano, et al., 2004
Senatore, F.; Rigano, D.; de Fusco, R.; Bruno, M., Composition of the essential oil from flowerheads of Chrysanthemum coronarium L. (Asteraceae) growing wild in Southern Italy, Flavour Fragr. J., 2004, 19, 2, 149-152, https://doi.org/10.1002/ffj.1285 . [all data]

Raal, Arak, et al., 2003
Raal, A.; Arak, E.; Orav, A.; Ivask, K., Comparison of essential oil content of Matricaria recutita L. from different origins, Ars Pharm., 2003, 44, 2, 159-165, retrieved from http://www.ugr.es/~ars/abstract/44-159-03.pdf. [all data]

Das, Ram, et al., 2002
Das, M.; Ram, G.; Singh, A.; Mallavarapu, G.R.; Ramesh, S.; Ram, M.; Kumar, S., Volatile constituents of different plant parts of Chamomilla recutita L. Rausch grown in the Indo-Gangetic plains, Flavour Fragr. J., 2002, 17, 1, 9-12, https://doi.org/10.1002/ffj.1035 . [all data]

HEuskin, Godin, et al., 2009
HEuskin, S.; Godin, B.; Leroy, P.; Quentin C.; Wathelet, J.-P.; Verheggen, F.; Haubruge, E.; Lognay, G., Fast gas chromatography characterization of purified semiochemicals from essential oils of Matricaria chamomilla L. (Asteraceae) and Nepeta cataria L. (Lamiaceae), J. Chromatorg. A., 2009, 1216, 14, 2768-2775, https://doi.org/10.1016/j.chroma.2008.09.109 . [all data]