Hexadec-11-yn-13,15-diene

Normal alkane RI, non-polar column, temperature ramp

View large format table.

Column type Active phase I Reference Comment
CapillaryBP-11626.Das, Ram, et al., 200225. m/0.50 mm/0.25 μm, N2, 5. K/min, 220. C @ 10. min; Tstart: 60. C

References

Das, Ram, et al., 2002
Das, M.; Ram, G.; Singh, A.; Mallavarapu, G.R.; Ramesh, S.; Ram, M.; Kumar, S., Volatile constituents of different plant parts of Chamomilla recutita L. Rausch grown in the Indo-Gangetic plains, Flavour Fragr. J., 2002, 17, 1, 9-12, https://doi.org/10.1002/ffj.1035 . [all data]