Cubebene

Normal alkane RI, non-polar column, temperature ramp

View large format table.

Column type Active phase I Reference Comment
CapillaryZP-51334.Füssel, Dötterl, et al., 200760. m/0.25 mm/0.25 μm, He, 40. C @ 7. min, 6. K/min, 260. C @ 1. min

Normal alkane RI, non-polar column, custom temperature program

View large format table.

Column type Active phase I Reference Comment
Capillary5 % Phenyl methyl siloxane1371.Agabriel, Cornu, et al., 2007Program: not specified
CapillaryHP-5MS1352.Ansorena, Gimeno, et al., 200130. m/0.25 mm/0.25 μm, He; Program: 40C (10min) => 3C/min => 120C => 10C/min => 250C (5min)

Normal alkane RI, polar column, temperature ramp

View large format table.

Column type Active phase I Reference Comment
CapillaryTC-FFAP1708.Kurose, Okamura, et al., 2007He, 3. K/min, 220. C @ 30. min; Column diameter: 0.25 mm; Phase thickness: 0.25 μm; Tstart: 60. C

References

Füssel, Dötterl, et al., 2007
Füssel, U.; Dötterl, S.; Jürgens, A.; Aas, G., Inter- and intraspecific variation in floral scent in the genus Salix and its implication for pollination, J. Chem. Ecol., 2007, 33, 4, 749-765, https://doi.org/10.1007/s10886-007-9257-6 . [all data]

Agabriel, Cornu, et al., 2007
Agabriel, C.; Cornu, A.; Journal, C.; Sibra, C.; Groller, C.; MArtin, B., Tanker milk variability according to farm feeding practices: vitamins A and E, carotenoids, color, and terpenoids, J. Dairy Sci., 2007, 90, 10, 4884-4896, https://doi.org/10.3168/jds.2007-0171 . [all data]

Ansorena, Gimeno, et al., 2001
Ansorena, D.; Gimeno, O.; Astiasarán, I.; Bello, J., Analysis of volatile compounds by GC-MS of a dry fermented sausage: chorizo de Pamplona, Food Res. Int., 2001, 34, 1, 67-75, https://doi.org/10.1016/S0963-9969(00)00133-2 . [all data]

Kurose, Okamura, et al., 2007
Kurose, K.; Okamura, D.; Yatagai, M., Composition of the essential oils from the leaves of nine Pinus species and the cones of three of Pinus species, Flavour Fragr. J., 2007, 22, 1, 10-20, https://doi.org/10.1002/ffj.1609 . [all data]