Benzene, 2-butyl-1,4-dimethyl

Kovats' RI, non-polar column, isothermal

View large format table.

Column type Active phase Temperature (C) I Reference Comment
CapillarySqualane86.1165.3Macák, Nabivach, et al., 1982N2; Column length: 50. m; Column diameter: 0.25 mm
CapillarySqualane96.1167.1Macák, Nabivach, et al., 1982N2; Column length: 50. m; Column diameter: 0.25 mm
CapillarySqualane86.1165.3Nabivach, Bur'yan, et al., 1978Column length: 50. m; Column diameter: 0.25 mm
CapillarySqualane96.1167.1Nabivach, Bur'yan, et al., 1978Column length: 50. m; Column diameter: 0.25 mm

Kovats' RI, polar column, isothermal

View large format table.

Column type Active phase Temperature (C) I Reference Comment
CapillaryCarbowax 20M90.1469.2Döring, Estel, et al., 1974Column length: 100. m; Column diameter: 0.2 mm

Normal alkane RI, polar column, isothermal

View large format table.

Column type Active phase Temperature (C) I Reference Comment
CapillaryPEG-40M100.1518.Nesterov, Nesterova, et al., 2000Column length: 50. m
CapillaryPEG-40M100.1519.Nesterov, Nesterova, et al., 2000Column length: 50. m
CapillaryPEG-40M120.1532.Nesterov, Nesterova, et al., 2000Column length: 50. m
CapillaryPEG-40M140.1546.Nesterov, Nesterova, et al., 2000Column length: 50. m
CapillaryPEG-40M160.1559.Nesterov, Nesterova, et al., 2000Column length: 50. m
CapillaryPEG-40M80.1505.Nesterov, Nesterova, et al., 2000Column length: 50. m
CapillaryCarbowax 20M90.1469.Sutter, Peterson, et al., 1997

Normal alkane RI, polar column, custom temperature program

View large format table.

Column type Active phase I Reference Comment
CapillaryCarbowax 20M1469.Ivanciuc, Ivanciuc, et al., 2001Program: not specified

References

Macák, Nabivach, et al., 1982
Macák, J.; Nabivach, V.; Buryan, P.; Sindler, S., Dependence of retention indices of alkylbenzenes on their molecular structure, J. Chromatogr., 1982, 234, 2, 285-302, https://doi.org/10.1016/S0021-9673(00)81867-1 . [all data]

Nabivach, Bur'yan, et al., 1978
Nabivach, V.M.; Bur'yan, P.; Matsak, I., Retention indices of aromatic hydrocarbons on a squalane capillary column, Zh. Anal. Khim., 1978, 33, 7, 1108-1113. [all data]

Döring, Estel, et al., 1974
Döring, C.E.; Estel, D.; Fischer, R., Kapillar-gaschromatographische Charakterisierung von C10-bis C12-Aromaten, J. Prakt. Chem., 1974, 316, 1, 1-12, https://doi.org/10.1002/prac.19743160102 . [all data]

Nesterov, Nesterova, et al., 2000
Nesterov, I.A.; Nesterova, T.N.; Pimerzin, A.A.; Tsvetkov, V.S., Thermodynamics of alkylbenzene sorption and evaporation. IV. Enthalpies of evaporation and thermodynamics chracteristics of sorption by stationary phases OV-101 and PEG-40M, Izvestia vysshikh uchebnykh zavedenii. Khimia i khimicheskaia tekhnologia (Chemistry and chemical technology), 2000, 43, 4, 39-45. [all data]

Sutter, Peterson, et al., 1997
Sutter, J.M.; Peterson, T.A.; Jurs, P.C., Prediction of gas chromatographic retention indices of alkylbenzenes, Anal. Chim. Acta., 1997, 342, 2-3, 113-122, https://doi.org/10.1016/S0003-2670(96)00578-8 . [all data]

Ivanciuc, Ivanciuc, et al., 2001
Ivanciuc, O.; Ivanciuc, T.; Klein, D.J.; Seitz, W.A.; Balaban, A.T., Quantitative structure-retention relationships for gas chromatographic retention indices of alkylbenzenes with molecular graph descriptors, SAR QSAR Environ. Res., 2001, 11, 5-6, 419-452, https://doi.org/10.1080/10629360108035362 . [all data]