8-Hydroxysandaracopimaradiene

Normal alkane RI, non-polar column, temperature ramp

View large format table.

Column type Active phase I Reference Comment
CapillaryHP-12090.Cavaleiro, Salgueiro, et al., 200230. m/0.25 mm/0.25 μm, He, 3. K/min, 220. C @ 15. min; Tstart: 70. C

References

Cavaleiro, Salgueiro, et al., 2002
Cavaleiro, C.; Salgueiro, L.; Barroso, J.G.; Figueiredo, A.C.; Pedro, L.G.; Fontinha, S.S.; Bighelli, A.; Casanova, J.; Looman, A.; Scheffer, J.J.C., Composition of the essential oil of Juniperus cedrus Webb and Berth. grown on Madeira, Flavour Fragr. J., 2002, 17, 2, 111-114, https://doi.org/10.1002/ffj.1061 . [all data]