Calamenene oxide

Normal alkane RI, non-polar column, temperature ramp

Data compiled by: NIST Mass Spectrometry Data Center, William E. Wallace, director

Column type CapillaryCapillary
Active phase HP-5DB-5
Column length (m) 30.30.
Carrier gas HeliumHe
Substrate
Column diameter (mm) 0.320.25
Phase thickness (μm) 0.250.25
Tstart (C) 40.60.
Tend (C) 300.270.
Heat rate (K/min) 4.3.
Initial hold (min)
Final hold (min) 5.
I 1481.1490.
ReferenceUtsunomia, Kawata, et al., 2005Palmeira, Conserva, et al., 2001
Comment MSDC-RI MSDC-RI

References

Utsunomia, Kawata, et al., 2005
Utsunomia, H.; Kawata, J.; Chanoki, W.; Shirakawa, N.; Miyazawa, M., Components of Essential Oil from Woods of Prunus mume Sieb. at Zucc., J. Oleo Sci., 2005, 54, 11, 609-612, https://doi.org/10.5650/jos.54.609 . [all data]

Palmeira, Conserva, et al., 2001
Palmeira, S.F., Jr.; Conserva, L.M.; Andrade, E.H.A.; Guilhon, G.M.S.P., Analysis by GC-MS of the hexane extract of the aerial parts of Aristolochia acutifolia Duchtr., Flavour Fragr. J., 2001, 16, 2, 85-88, https://doi.org/10.1002/1099-1026(200103/04)16:2<85::AID-FFJ948>3.0.CO;2-2 . [all data]