Proisocalamendiol

Kovats' RI, non-polar column, temperature ramp

View large format table.

Column type Active phase I Reference Comment
CapillaryDB-11587.Nagalakshmi, Thangadurai, et al., 200128. m/0.25 mm/0.25 μm, He, 50. C @ 1. min, 4.5 K/min; Tend: 270. C

References

Nagalakshmi, Thangadurai, et al., 2001
Nagalakshmi, M.A.H.; Thangadurai, D.; Anuradha, T.; Pullaiah, T., Essential oil constituents of Melia dubia, a wild relative of Azadirachta indica growing in the Eastern Ghats of Peninsular India, Flavour Fragr. J., 2001, 16, 4, 241-244, https://doi.org/10.1002/ffj.986 . [all data]