Laurenene

Normal alkane RI, non-polar column, temperature ramp

Data compiled by: NIST Mass Spectrometry Data Center, William E. Wallace, director

Column type Capillary
Active phase DB-5MS
Column length (m) 30.
Carrier gas He
Substrate
Column diameter (mm) 0.25
Phase thickness (μm) 0.25
Tstart (C) 60.
Tend (C) 240.
Heat rate (K/min) 3.
Initial hold (min)
Final hold (min) 30.
I 1935.
ReferenceMarongiu, Porcedda, et al., 2001
Comment MSDC-RI

Van Den Dool and Kratz RI, non-polar column, temperature ramp

Data compiled by: NIST Mass Spectrometry Data Center, William E. Wallace, director

Column type Capillary
Active phase HP-5
Column length (m) 30.
Carrier gas He
Substrate
Column diameter (mm) 0.25
Phase thickness (μm) 0.25
Tstart (C) 60.
Tend (C) 280.
Heat rate (K/min) 3.
Initial hold (min)
Final hold (min)
I 1872.
ReferenceFokialakis, Melliou, et al., 2003
Comment MSDC-RI

References

Marongiu, Porcedda, et al., 2001
Marongiu, B.; Porcedda, S.; Porta, G.D.; Reverchon, E., Extraction and isolation of Salvia desoleana and Mentha spicata subsp. insularis essential oils by supercritical CO2, Flavour Fragr. J., 2001, 16, 5, 384-388, https://doi.org/10.1002/ffj.1021 . [all data]