4-epi-Cubebol

Kovats' RI, polar column, temperature ramp

Data compiled by: NIST Mass Spectrometry Data Center, William E. Wallace, director

Column type Capillary
Active phase Supelcowax-10
Column length (m) 30.
Carrier gas
Substrate
Column diameter (mm) 0.25
Phase thickness (μm) 0.25
Tstart (C) 40.
Tend (C) 210.
Heat rate (K/min) 2.
Initial hold (min) 2.
Final hold (min) 33.
I 1956.
ReferenceSylvestre, Pichette, et al., 2006
Comment MSDC-RI

References

Sylvestre, Pichette, et al., 2006
Sylvestre, M.; Pichette, A.; Longtin, A.; Nagau, F.; Legault, J., Essential oil analysis and anticancer activity of leaf essential oil of Croton flavens L. from Guadeloupe, J. Ethnopharmacol., 2006, 103, 1, 99-102, https://doi.org/10.1016/j.jep.2005.07.011 . [all data]