Muurola-4,9-diene

Kovats' RI, non-polar column, temperature ramp

Data compiled by: NIST Mass Spectrometry Data Center, William E. Wallace, director

Column type Capillary
Active phase PTE-5
Column length (m) 60.
Carrier gas H2
Substrate
Column diameter (mm) 0.32
Phase thickness (μm) 0.39
Tstart (C) 60.
Tend (C) 285.
Heat rate (K/min) 4.3
Initial hold (min)
Final hold (min)
I 1540.
ReferenceGudzic, Dordevic, et al., 2001
Comment MSDC-RI

References

Gudzic, Dordevic, et al., 2001
Gudzic, B.; Dordevic, S.; Palic, R.; Stojanovic, G., Essential oils of Hypericum olympicum L. and Hypericum perforatum L., Flavour Fragr. J., 2001, 16, 3, 201-203, https://doi.org/10.1002/ffj.978 . [all data]