Eremophyllene

Van Den Dool and Kratz RI, non-polar column, temperature ramp

Data compiled by: NIST Mass Spectrometry Data Center, William E. Wallace, director

Column type CapillaryCapillary
Active phase DB-5DB-5
Column length (m) 30.30.
Carrier gas HeHe
Substrate
Column diameter (mm) 0.250.25
Phase thickness (μm) 0.250.25
Tstart (C) 60.60.
Tend (C) 300.300.
Heat rate (K/min) 5.5.
Initial hold (min) 3.3.
Final hold (min)
I 1492.1492.
ReferenceBortolomeazzi, Berno, et al., 2001Bortolomeazzi, Pizzale, et al., 2000
Comment MSDC-RI MSDC-RI

Normal alkane RI, polar column, temperature ramp

Data compiled by: NIST Mass Spectrometry Data Center, William E. Wallace, director

Column type CapillaryCapillary
Active phase Carbowax 20MInnowax
Column length (m) 50.60.
Carrier gas HeHe
Substrate
Column diameter (mm) 0.220.25
Phase thickness (μm) 0.250.25
Tstart (C) 60.60.
Tend (C) 220.220.
Heat rate (K/min) 2.
Initial hold (min)  10.
Final hold (min)
I 1710.1744.
ReferenceVernin, Lageot, et al., 2001Kaya, Baser, et al., 1999
Comment MSDC-RI MSDC-RI

Normal alkane RI, non-polar column, temperature ramp

Data compiled by: NIST Mass Spectrometry Data Center, William E. Wallace, director

Column type Capillary
Active phase PTE-5
Column length (m) 60.
Carrier gas H2
Substrate
Column diameter (mm) 0.32
Phase thickness (μm) 0.30
Tstart (C) 60.
Tend (C) 285.
Heat rate (K/min) 4.3
Initial hold (min)
Final hold (min)
I 1491.
ReferenceGudzic, Djokovic, et al., 2002
Comment MSDC-RI

Kovats' RI, non-polar column, temperature ramp

Data compiled by: NIST Mass Spectrometry Data Center, William E. Wallace, director

Column type Capillary
Active phase PTE-5
Column length (m) 60.
Carrier gas H2
Substrate
Column diameter (mm) 0.32
Phase thickness (μm) 0.39
Tstart (C) 60.
Tend (C) 285.
Heat rate (K/min) 4.3
Initial hold (min)
Final hold (min)
I 1490.
ReferenceGudzic, Dordevic, et al., 2001
Comment MSDC-RI

References

Bortolomeazzi, Berno, et al., 2001
Bortolomeazzi, R.; Berno, P.; Pizzale, L.; Conte, L.S., Sesquiterpene, alkene, and alkane hydrocarbons in virgin olive oils of different varieties and geographical origins, J. Agric. Food Chem., 2001, 49, 7, 3278-3283, https://doi.org/10.1021/jf001271w . [all data]

Bortolomeazzi, Pizzale, et al., 2000
Bortolomeazzi, R.; Pizzale, L.; Vichi, S.; Piasenzotto, L.; Conte, L.S., GC-MS Characterization of sesquiterpenic hydrocarbons in virgin olive oils, Proceedings 23rd ISCC; CD-ROM, 2000, retrieved from http://www.richrom.com/assets/CD23PDF. [all data]