2-Chloroethyl isohexanoate

Kovats' RI, non-polar column, isothermal

Data compiled by: NIST Mass Spectrometry Data Center, William E. Wallace, director

Column type Capillary
Active phase OV-101
Column length (m) 15.
Carrier gas N2
Substrate
Column diameter (mm) 0.22
Phase thickness (μm)
Temperature (C) 80.
I 1153.
ReferenceKomárek, Hornová, et al., 1982
Comment MSDC-RI

References

Komárek, Hornová, et al., 1982
Komárek, K.; Hornová, L.; Churácek, J., Glass capillary gas chromatography of homologous series of esters. II. Separation of homologous series of halogenoethyl esters of aliphatic monocarboxylic acids on OV-101, J. Chromatogr., 1982, 252, 293-296, https://doi.org/10.1016/S0021-9673(01)88420-X . [all data]