Teferin

Normal alkane RI, non-polar column, temperature ramp

View large format table.

Column type Active phase I Reference Comment
CapillaryDB-12858.Diab, Dolmazon, et al., 2001He, 3. K/min; Column length: 25. m; Column diameter: 0.23 mm; Tstart: 60. C; Tend: 250. C

References

Diab, Dolmazon, et al., 2001
Diab, Y.; Dolmazon, R.; Bessière, J.-M., Daucane aryl esters composition from the Lebanese Ferula hermonis Boiss. (zallooh root), Flavour Fragr. J., 2001, 16, 2, 120-122, https://doi.org/10.1002/ffj.966 . [all data]