cedr-8(15)-en-9-α-ol

Van Den Dool and Kratz RI, non-polar column, temperature ramp

Data compiled by: NIST Mass Spectrometry Data Center, William E. Wallace, director

Column type CapillaryCapillaryCapillary
Active phase DB-5HP-5MSHP-5
Column length (m) 50.30.30.
Carrier gas N2 He
Substrate
Column diameter (mm) 0.20.250.25
Phase thickness (μm) 0.320.250.25
Tstart (C) 60.50.60.
Tend (C) 220.280.380.
Heat rate (K/min) 5.3.3.
Initial hold (min) 3.5.
Final hold (min) 5.
I 1644.1644.1642.
ReferenceMasoudi, Esmaeili, et al., 2006Demetzos, Angelopoulou, et al., 2002Couladis, Tsortanidou, et al., 2001
Comment MSDC-RI MSDC-RI MSDC-RI

References

Masoudi, Esmaeili, et al., 2006
Masoudi, S.; Esmaeili, A.; Khalilzadeh, M.A.; Rustaiyan, A.; Moazami, N.; Akhgar, M.R.; Varavipoor, M., Volatile constituents of Dorema aucheri Boiss., Seseli libanotis (L.) W. D. Koch var. armeniacum bordz. and Conium maculatum L. three Umbelliferae herbs growing wild in Iran, Flavour Fragr. J., 2006, 21, 5, 801-804, https://doi.org/10.1002/ffj.1722 . [all data]

Demetzos, Angelopoulou, et al., 2002
Demetzos, C.; Angelopoulou, D.; Perdetzoglou, D., A comparative study of the essential oils of Cistus salviifolius in several populations of Crete (Greece), Biochem. Syst. Ecol., 2002, 30, 7, 651-665, https://doi.org/10.1016/S0305-1978(01)00145-4 . [all data]

Couladis, Tsortanidou, et al., 2001
Couladis, M.; Tsortanidou, V.; Francisco-Ortega, J.; Santos-Guerra, A.; Harvala, C., Composition of the essential oils of Argyranthemum species growing in the Canary Islands, Flavour Fragr. J., 2001, 16, 2, 103-106, https://doi.org/10.1002/ffj.954 . [all data]