1,6-Dioxaspiro[4,4]nona-2,8-diene, 7-(2,4)-hexadiynylidene

Normal alkane RI, non-polar column, temperature ramp

View large format table.

Column type Active phase I Reference Comment
CapillaryDB-51789.Senatore, Rigano, et al., 200430. m/0.25 mm/0.25 μm, He, 40. C @ 5. min, 2. K/min, 250. C @ 20. min
CapillaryDB-5MS1799.Cherchi, Deidda, et al., 200130. m/0.25 mm/0.25 μm, He, 3. K/min; Tstart: 60. C; Tend: 240. C

References

Senatore, Rigano, et al., 2004
Senatore, F.; Rigano, D.; de Fusco, R.; Bruno, M., Composition of the essential oil from flowerheads of Chrysanthemum coronarium L. (Asteraceae) growing wild in Southern Italy, Flavour Fragr. J., 2004, 19, 2, 149-152, https://doi.org/10.1002/ffj.1285 . [all data]

Cherchi, Deidda, et al., 2001
Cherchi, G.; Deidda, D.; de Gioannis, B.; Marongiu, B.; Pompei, R.; Porcedda, S., Extraction of Santolina insularis essential oil by supercritical carbon dioxide: influence of some process parameters and biological activity, Flavour Fragr. J., 2001, 16, 1, 35-43, https://doi.org/10.1002/1099-1026(200101/02)16:1<35::AID-FFJ942>3.0.CO;2-Y . [all data]