epi-α-Bisabolol

Van Den Dool and Kratz RI, non-polar column, temperature ramp

Data compiled by: NIST Mass Spectrometry Data Center, William E. Wallace, director

Column type CapillaryCapillaryCapillaryCapillaryCapillary
Active phase HP-5DB-5ZB-5DB-5DB-1
Column length (m) 30.30.30.50.30.
Carrier gas N2HeHeN2N2
Substrate
Column diameter (mm) 0.250.250.250.20.25
Phase thickness (μm) 0.250.250.250.320.25
Tstart (C) 60.60.50.60.50.
Tend (C) 220.240.250.220.200.
Heat rate (K/min) 5.3.3.5.5.
Initial hold (min) 10.  3.
Final hold (min)    5.
I 1647.1688.1685.1686.1688.
ReferenceFlamini, Tebano, et al., 2007Maccioni, Baldini, et al., 2007Simoniatto, Bonani, et al., 2007Masoudi, Esmaeili, et al., 2006Menut, Cabalion, et al., 2005
Comment MSDC-RI MSDC-RI MSDC-RI MSDC-RI MSDC-RI
Column type CapillaryCapillaryCapillaryCapillaryCapillary
Active phase DB-5SE-54RTX-5RTX-1RTX-5
Column length (m) 30.25.30.60.30.
Carrier gas HeH2HeHeHe
Substrate
Column diameter (mm) 0.250.250.250.220.25
Phase thickness (μm) 0.260.20.250.250.25
Tstart (C) 60.50.45.60.45.
Tend (C) 210.250.300.230.300.
Heat rate (K/min) 3.4.3.2.3.
Initial hold (min)   6. 6.
Final hold (min)   10.45.10.
I 1687.1688.1689.1671.1689.
ReferenceSati and Mathela, 2005Simionatto, Porto, et al., 2005Dugo, Mondello, et al., 2004Cavalli, Tomi, et al., 2003Mondello, Zappia, et al., 2002
Comment MSDC-RI MSDC-RI MSDC-RI MSDC-RI MSDC-RI
Column type CapillaryCapillaryCapillaryCapillary
Active phase CP Sil 5 CBHP-5DB-5OV-1
Column length (m) 50.30.30.25.
Carrier gas HeHeH2
Substrate
Column diameter (mm) 0.320.250.250.25
Phase thickness (μm) 0.40.250.250.3
Tstart (C) 60.60.60.50.
Tend (C) 280.380.240.200.
Heat rate (K/min) 3.3.3.3.
Initial hold (min) 10.  1.
Final hold (min) 60.  20.
I 1671.1680.1685.1670.
ReferencePino, Marbot, et al., 2002Couladis, Tsortanidou, et al., 2001Nogueira, Bittrich, et al., 2001Bicchi, Rubiolo, et al., 1998
Comment MSDC-RI MSDC-RI MSDC-RI MSDC-RI

Normal alkane RI, polar column, custom temperature program

Data compiled by: NIST Mass Spectrometry Data Center, William E. Wallace, director

Column type CapillaryCapillary
Active phase HP-Innowax FSCHP-Innowax FSC
Column length (m) 60.60.
Carrier gas N2He
Substrate
Column diameter (mm) 0.250.25
Phase thickness (μm) 0.250.25
Program 60C(10min) => 4C/min => 220C(10min) => 1C/min => 240C60C (10min) => 4C/min => 220C (10min) => 1C/min => 240C
I 2256.2256.
ReferenceDemirci B., Baser K.H.C., et al., 2006Demirci, Baser, et al., 2003
Comment MSDC-RI MSDC-RI

References

Flamini, Tebano, et al., 2007
Flamini, G.; Tebano, M.; Cioni, P.L.; Ceccarini, L.; Ricci, A.S.; Longo, I., Comparison between the conventional method of extraction of essential oil of Laurus nobilis L. and a novel method which uses microwaves applied in situ, without resorting to an oven, J. Chromatogr. A, 2007, 1143, 1-2, 36-40, https://doi.org/10.1016/j.chroma.2007.01.031 . [all data]

Maccioni, Baldini, et al., 2007
Maccioni, S.; Baldini, R.; Luigi Cioni, P.; Tebano, M.; Flamini, G., In vivo volatiles emission and essential oils from different organs and pollen of Cistus albidus from Caprione (Eastern Liguria, Italy), Flavour Fragr. J., 2007, 22, 1, 61-65, https://doi.org/10.1002/ffj.1759 . [all data]

Simoniatto, Bonani, et al., 2007
Simoniatto, E.; Bonani, V.F.L.; Morel, A.F.; Poppi, N.R.; Raposo, J.L., Jr.; Stuker, C.Z.; Peruzzo, G.M.; Peres, M.T.L.P.; Hess, S.C., Chemical composition and evaluation of antibacterial and antioxidant activities of the essential oil of Croton urucurana Baillon (Euphorbiaceae) stem bark, J. Braz. Chem., 2007, 18, 5, 879-885, https://doi.org/10.1590/S0103-50532007000500002 . [all data]

Masoudi, Esmaeili, et al., 2006
Masoudi, S.; Esmaeili, A.; Khalilzadeh, M.A.; Rustaiyan, A.; Moazami, N.; Akhgar, M.R.; Varavipoor, M., Volatile constituents of Dorema aucheri Boiss., Seseli libanotis (L.) W. D. Koch var. armeniacum bordz. and Conium maculatum L. three Umbelliferae herbs growing wild in Iran, Flavour Fragr. J., 2006, 21, 5, 801-804, https://doi.org/10.1002/ffj.1722 . [all data]

Menut, Cabalion, et al., 2005
Menut, C.; Cabalion, P.; Hnawia, E.; Agnaniet, H.; Waikedre, J.; Fruchier, A., Two new furanosesquiterpenes from Myoporum crassifolium from New Caledonia, Flavour Fragr. J., 2005, 20, 6, 621-625, https://doi.org/10.1002/ffj.1509 . [all data]

Sati and Mathela, 2005
Sati, S.; Mathela, C.S., Essential oil composition of Valeriana hardwickii var. arnottiana from the Himalayas, Flavour Fragr. J., 2005, 20, 3, 299-301, https://doi.org/10.1002/ffj.1415 . [all data]

Simionatto, Porto, et al., 2005
Simionatto, E.; Porto, C.; da Silva, U.F.; Squizani, A.; Dalcol, I.I.; Morel, A.F., Composition and antimicrobial activity of the essential oil from Aloysia sellowii, J. Braz. Chem. Soc., 2005, 16, 6B, 1458-1462, https://doi.org/10.1590/S0103-50532005000800028 . [all data]

Dugo, Mondello, et al., 2004
Dugo, P.; Mondello, L.; Zappia, G.; Bonaccorsi, I.; Cotroneo, A.; Russo, M.T., The composition of the volatile fraction and the enantiomeric distribution of five volatile components of faustrime oil (Monocitrus australatica x Fortunella sp. x Citrus aurantifolia), J. Essent. Oil Res., 2004, 16, 4, 328-333, https://doi.org/10.1080/10412905.2004.9698734 . [all data]

Cavalli, Tomi, et al., 2003
Cavalli, J.-F.; Tomi, F.; Bernardini, A.-F.; Casanova, J., Composition and chemical variability of the bark oil of Cedrelopsis grevei H. Baillon from Madagascar, Flavour Fragr. J., 2003, 18, 6, 532-538, https://doi.org/10.1002/ffj.1263 . [all data]

Mondello, Zappia, et al., 2002
Mondello, L.; Zappia, G.; Cotroneo, A.; Bonaccorsi, I.; Chowdhury, J.U.; Yusuf, M.; Dugo, G., Studies on the essential oil-bearing plants of Bangladesh. Part VIII. Composition of some Ocimum oils O. basilicum L. var. purpurascens; O. sanctum L. green; O. sanctum L. purple; O. americanum L., citral type; O. americanum L., camphor type, Flavour Fragr. J., 2002, 17, 5, 335-340, https://doi.org/10.1002/ffj.1108 . [all data]

Pino, Marbot, et al., 2002
Pino, J.A.; Marbot, R.; Vázquez, C., Characterization of volatile in Cosa Rican Guava [Psidium friedrichsthalianum (Berg) Niedenzu] fruit, J. Agric. Food Chem., 2002, 50, 21, 6023-6026, https://doi.org/10.1021/jf011456i . [all data]

Couladis, Tsortanidou, et al., 2001
Couladis, M.; Tsortanidou, V.; Francisco-Ortega, J.; Santos-Guerra, A.; Harvala, C., Composition of the essential oils of Argyranthemum species growing in the Canary Islands, Flavour Fragr. J., 2001, 16, 2, 103-106, https://doi.org/10.1002/ffj.954 . [all data]

Nogueira, Bittrich, et al., 2001
Nogueira, P.C.L.; Bittrich, V.; Shepherd, G.J.; Lopes, A.V.; Marsaioli, A.J., The ecological and taxonomic importance of flower volatiles of Clusia species (Guttiferae), Phytochemistry, 2001, 56, 5, 443-452, https://doi.org/10.1016/S0031-9422(00)00213-2 . [all data]

Bicchi, Rubiolo, et al., 1998
Bicchi, C.; Rubiolo, P.; Marschall, H.; Weyerstahl, P.; Laurent, R., Constituents of Artemisia roxburghiana Besser essential oil, Flavour Fragr. J., 1998, 13, 1, 40-46, https://doi.org/10.1002/(SICI)1099-1026(199801/02)13:1<40::AID-FFJ688>3.0.CO;2-Z . [all data]