Theaspirane B

Normal alkane RI, polar column, temperature ramp

Data compiled by: NIST Mass Spectrometry Data Center, William E. Wallace, director

Column type CapillaryCapillaryCapillary
Active phase CarbowaxInnowaxDB-Wax
Column length (m) 60.60.60.
Carrier gas HeHeNitrogen
Substrate
Column diameter (mm) 0.20.250.32
Phase thickness (μm) 0.250.250.50
Tstart (C) 60.60.35.
Tend (C) 250.240.235.
Heat rate (K/min) 2.5.2.
Initial hold (min) 8. 4.
Final hold (min) 15.30.30.
I 1520.1550.1566.
ReferenceFerhat, Tigrine-Kordjani, et al., 2007Joichi, Yomogida, et al., 2005Qian and Wang, 2005
Comment MSDC-RI MSDC-RI MSDC-RI

Van Den Dool and Kratz RI, non-polar column, temperature ramp

Data compiled by: NIST Mass Spectrometry Data Center, William E. Wallace, director

Column type CapillaryCapillary
Active phase HP-5HP-5
Column length (m) 30.30.
Carrier gas N2N2
Substrate
Column diameter (mm) 0.250.25
Phase thickness (μm) 0.250.25
Tstart (C) 60.60.
Tend (C) 220.220.
Heat rate (K/min) 5.5.
Initial hold (min) 10.10.
Final hold (min)
I 1315.1315.
ReferenceCampeol, Flamini, et al., 2003Campeol, Flamini, et al., 2003
Comment MSDC-RI MSDC-RI

References

Ferhat, Tigrine-Kordjani, et al., 2007
Ferhat, M.A.; Tigrine-Kordjani, N.; Chemat, S.; Meklati, B.Y.; Chemat, F., Rapid Extraction of Volatile Compounds Using a New Simultaneous Microwave Distillation: Solvent Extraction Device, Chromatographia, 2007, 65, 3-4, 217-222, https://doi.org/10.1365/s10337-006-0130-5 . [all data]

Joichi, Yomogida, et al., 2005
Joichi, A.; Yomogida, K.; Awano, K.; Ueda, Y., Volatile components of tea-scented modern roses and ancient Chinese roses, Flavour Fragr. J., 2005, 20, 2, 152-157, https://doi.org/10.1002/ffj.1388 . [all data]

Qian and Wang, 2005
Qian, M.C.; Wang, Y., Seasonal Variations of Volatile Composition and Odor Activity Value of Marion (Rubus spp. hyb) and Thornless Evergreen (R.laciniatus L.) Blackberries, J. Food. Sci., 2005, 70, 1, c13-c20, https://doi.org/10.1111/j.1365-2621.2005.tb09013.x . [all data]