Theaspirane A

Van Den Dool and Kratz RI, non-polar column, temperature ramp

Data compiled by: NIST Mass Spectrometry Data Center, William E. Wallace, director

Column type CapillaryCapillary
Active phase HP-5HP-5
Column length (m) 30.30.
Carrier gas N2N2
Substrate
Column diameter (mm) 0.250.25
Phase thickness (μm) 0.250.25
Tstart (C) 60.60.
Tend (C) 220.220.
Heat rate (K/min) 5.5.
Initial hold (min) 10.10.
Final hold (min)
I 1298.1298.
ReferenceCampeol, Flamini, et al., 2003Campeol, Flamini, et al., 2003
Comment MSDC-RI MSDC-RI

Normal alkane RI, non-polar column, temperature ramp

Data compiled by: NIST Mass Spectrometry Data Center, William E. Wallace, director

Column type CapillaryCapillaryCapillaryCapillaryCapillary
Active phase HP-5 MSHP-5MSHP-5HP-5HP-5
Column length (m) 30.30.30.30.60.
Carrier gas HeliumHeHeHeHe
Substrate
Column diameter (mm) 0.250.250.320.320.32
Phase thickness (μm) 0.250.250.250.250.25
Tstart (C) 50.60.60.60.30.
Tend (C) 240.250.260.260.260.
Heat rate (K/min) 3.2.5.5.2.
Initial hold (min)  8.2.2.2.
Final hold (min)  15.14.14.28.
I 1313.1284.1298.1300.1300.6
ReferenceSarikurkcu, Tepe, et al., 2008Ferhat, Tigrine-Kordjani, et al., 2007Yayli, Gülec, et al., 2006Yayli, Gülec, et al., 2006Leffingwell and Alford, 2005
Comment MSDC-RI MSDC-RI MSDC-RI MSDC-RI MSDC-RI
Column type CapillaryCapillary
Active phase DB-5Optima-1
Column length (m) 30.25.
Carrier gas HeHe
Substrate
Column diameter (mm) 0.250.20
Phase thickness (μm) 0.250.25
Tstart (C) 60.50.
Tend (C) 220.250.
Heat rate (K/min) 4.3.
Initial hold (min) 5.3.
Final hold (min)
I 1280.1303.
ReferenceMorteza-Semnani, Akbarzadeh, et al., 2005Brun, Bessière, et al., 2001
Comment MSDC-RI MSDC-RI

References

Campeol, Flamini, et al., 2003
Campeol, E.; Flamini, G.; Cioni, P.L.; Morelli, I.; Cremonini, R.; Ceccarini, L., Volatile fractions from three cultivars of Olea eruopaea L. collected in two different seasons, J. Agric. Food Chem., 2003, 51, 7, 1994-1999, https://doi.org/10.1021/jf026025u . [all data]