Sesquicineole

Normal alkane RI, non-polar column, temperature ramp

Data compiled by: NIST Mass Spectrometry Data Center, William E. Wallace, director

Column type CapillaryCapillaryCapillaryCapillary
Active phase HP-5 MSDB-1DB-5SPB-5
Column length (m) 30.50.30.60.
Carrier gas HeliumN2HeHe
Substrate
Column diameter (mm) 0.320.250.250.32
Phase thickness (μm) 0.250.250.25
Tstart (C) 60.95.60.40.
Tend (C) 280.240.240.220.
Heat rate (K/min) 4.4.3.3.
Initial hold (min) 5.  5.
Final hold (min)    15.
I 1515.1509.1513.1520.
ReferenceCapetanos, Saroglou, et al., 2007Pala-Paul, Perez-Alonso, et al., 2005Zoghbi, Andrade, et al., 2003Cornu, Carnat, et al., 2001
Comment MSDC-RI MSDC-RI MSDC-RI MSDC-RI

Van Den Dool and Kratz RI, polar column, temperature ramp

Data compiled by: NIST Mass Spectrometry Data Center, William E. Wallace, director

Column type Capillary
Active phase RTX-Wax
Column length (m) 60.
Carrier gas He
Substrate
Column diameter (mm) 0.22
Phase thickness (μm) 0.25
Tstart (C) 60.
Tend (C) 230.
Heat rate (K/min) 2.
Initial hold (min)
Final hold (min) 45.
I 1733.
ReferenceCavalli, Tomi, et al., 2003
Comment MSDC-RI

References

Capetanos, Saroglou, et al., 2007
Capetanos, C.; Saroglou, V.; Marin, P.D.; Simic, A.; Skaltsa, H.D., Essential oil snalysis of two endemic Eringium species from Serbia, J. Serb. Chem. Soc., 2007, 72, 10, 961-965, https://doi.org/10.2298/JSC0710961C . [all data]

Pala-Paul, Perez-Alonso, et al., 2005
Pala-Paul, J.; Perez-Alonso, M.J.; Velasco-Negueruela, A.; Vadare, J.; Villa, A.M.; Sanz, J.; Brophy, J.J., Essential oil composition of the different parts of Eryngium bourgatii Gouan from Spain, J. Chromatogr. A, 2005, 1074, 1-2, 235-239, https://doi.org/10.1016/j.chroma.2005.03.036 . [all data]

Zoghbi, Andrade, et al., 2003
Zoghbi, M.G.B.; Andrade, E.H.A.; da Silva, M.H.; Carreira, L.M.M.; Maia, J.G.S., Essential oils from three Myrcia species, Flavour Fragr. J., 2003, 18, 5, 421-424, https://doi.org/10.1002/ffj.1242 . [all data]

Cornu, Carnat, et al., 2001
Cornu, A.; Carnat, A.-P.; Martin, B.; Coulon, J.-B.; Lamaison, J.-L.; Berdagué, J.-L., Solid-phase microextraction of volatile components from natural grassland plants, J. Agric. Food Chem., 2001, 49, 1, 203-209, https://doi.org/10.1021/jf0008341 . [all data]