Khusione

Normal alkane RI, non-polar column, custom temperature program

View large format table.

Column type Active phase I Reference Comment
CapillaryCP Sil 5 CB1617.Weyerstahl, Marschall, et al., 2000Column length: 25. m; Program: not specified
CapillaryCP Sil 5 CB1617.Weyerstahl, Marschall, et al., 2000, 2N2; Column length: 25. m; Phase thickness: 0.39 μm; Program: not specified

References

Weyerstahl, Marschall, et al., 2000
Weyerstahl, P.; Marschall, H.; Splittgerber, U.; Wolf, D.; Surburg, H., Constituents of Haitian vetiver oil, Flavour Fragr. J., 2000, 15, 6, 395-412, https://doi.org/10.1002/1099-1026(200011/12)15:6<395::AID-FFJ930>3.0.CO;2-9 . [all data]

Weyerstahl, Marschall, et al., 2000, 2
Weyerstahl, P.; Marschall, H.; Splittgerber, U.; D., 1,7-Cyclogermacra-1(10),4-dien-15-al, a sesquiterpene with a novel skeleton, and other sesquiterpenes from Haitian vetiver oil, Flavour Fragr. J., 2000, 15, 2, 61-83, https://doi.org/10.1002/(SICI)1099-1026(200003/04)15:2<61::AID-FFJ865>3.0.CO;2-S . [all data]