Eudesma-4,6-dien-3-one (β-cyperone)

Normal alkane RI, non-polar column, custom temperature program

View large format table.

Column type Active phase I Reference Comment
CapillaryCP Sil 5 CB1745.Weyerstahl, Marschall, et al., 2000Column length: 25. m; Program: not specified
CapillaryCP Sil 5 CB1764.Weyerstahl, Marschall, et al., 1999He; Column length: 25. m; Column diameter: 0.39 mm; Program: not specified

References

Weyerstahl, Marschall, et al., 2000
Weyerstahl, P.; Marschall, H.; Splittgerber, U.; Wolf, D.; Surburg, H., Constituents of Haitian vetiver oil, Flavour Fragr. J., 2000, 15, 6, 395-412, https://doi.org/10.1002/1099-1026(200011/12)15:6<395::AID-FFJ930>3.0.CO;2-9 . [all data]

Weyerstahl, Marschall, et al., 1999
Weyerstahl, P.; Marschall, H.; Son, P.T.; Giang, P.M., Constituents of the flower essential oil of Aglaia odorata Lour. from Vietnam, Flavour Fragr. J., 1999, 14, 4, 219-224, https://doi.org/10.1002/(SICI)1099-1026(199907/08)14:4<219::AID-FFJ815>3.0.CO;2-# . [all data]