11-nor-Cadin-5-en-4-one, isomer B

Van Den Dool and Kratz RI, non-polar column, temperature ramp

View large format table.

Column type Active phase I Reference Comment
CapillaryHP-51687.Skaltsa, Lazari, et al., 200030. m/0.25 mm/0.25 μm, He, 50. C @ 5. min, 4. K/min; Tend: 280. C

References

Skaltsa, Lazari, et al., 2000
Skaltsa, H.D.; Lazari, D.M.; Loukis, A.E.; Constantinidis, T., Essential oil analysis of Nepeta argolica Bory Chaub. subsp. argolica (Lamiaceae) growing wild in Greece, Flavour Fragr. J., 2000, 15, 2, 96-99, https://doi.org/10.1002/(SICI)1099-1026(200003/04)15:2<96::AID-FFJ873>3.0.CO;2-F . [all data]