Humulene epoxide

Normal alkane RI, polar column, temperature ramp

Data compiled by: NIST Mass Spectrometry Data Center, William E. Wallace, director

Column type CapillaryCapillaryCapillaryCapillaryCapillary
Active phase RTX-WaxCarbowax 20MCarbowaxDB-WaxDB-Wax
Column length (m) 60.30.60.60.30.
Carrier gas HeHeHeN2He
Substrate
Column diameter (mm) 0.220.250.250.250.25
Phase thickness (μm) 0.250.250.250.250.25
Tstart (C) 60.60.40.70.50.
Tend (C) 230.230.180.230.180.
Heat rate (K/min) 2.3.5.2.3.
Initial hold (min)    2.
Final hold (min) 35.  20.40.
I 2011.1972.2012.1971.2038.
ReferencePaolini, Tomi, et al., 2008Limberger, Scopel, et al., 2007Singh, Kumar, et al., 2007Choi, 2006Lee, Umano, et al., 2005
Comment MSDC-RI MSDC-RI MSDC-RI MSDC-RI MSDC-RI
Column type CapillaryCapillaryCapillaryCapillaryCapillary
Active phase DB-WaxDB-WaxFFAPDB-WaxDB-Wax
Column length (m) 60.60.25.60.30.
Carrier gas HeHeN2HeN2
Substrate
Column diameter (mm) 0.250.250.250.250.319
Phase thickness (μm) 0.250.25 0.250.25
Tstart (C) 40.40.70.60.60.
Tend (C) 200.200.210.240.300.
Heat rate (K/min) 2.2.3.4.8.
Initial hold (min) 2.2.5.
Final hold (min)     15.
I 2010.2033.2037.2058.1972.
ReferenceUmano, Hagi, et al., 2000Umano, Hagi, et al., 2000Ajaiyeoba and Ekundayo, 1999Ngassoum, Yonkeu, et al., 1999Malizia, Molli, et al., 1996
Comment MSDC-RI MSDC-RI MSDC-RI MSDC-RI MSDC-RI

Normal alkane RI, non-polar column, custom temperature program

Data compiled by: NIST Mass Spectrometry Data Center, William E. Wallace, director

Column type CapillaryCapillaryCapillaryCapillaryCapillary
Active phase CP Sil 8 CBOV-1CP Sil 8 CBCP Sil 8 CBCP Sil 8 CB
Column length (m) 50.30.50.50.50.
Carrier gas HeHeHeHeHe
Substrate
Column diameter (mm) 0.320.250.320.320.32
Phase thickness (μm) 0.250.25
Program 60C(1min) => 5C/min => 160C => 5C/min => 250C(3min)45 0C (4 min) 3 0C/min -> 75 0C 4 0C/min -> 115 0C 6 0C/min -> 312 0C60C(2min) => 5C/min => 160C (1min) => 10C/min => 250C (2min)60C(2min) => 5C/min => 160C(1min) => 10C/min => 250C (2min)60C(2min) => 5C/min => 160C(1min) => 10C/min => 250C(2min)
I 1606.1590.1606.1606.1606.
ReferenceNivinskienë, Butkienë, et al., 2005Hafez and Abdel-Salam, 2004Judpentienë and Mockutë, 2004Mockute and Judzentiene, 2002Mockute and Judzentiene, 2002, 2
Comment MSDC-RI MSDC-RI MSDC-RI MSDC-RI MSDC-RI
Column type Capillary
Active phase DB-1
Column length (m) 30.
Carrier gas H2
Substrate
Column diameter (mm) 0.25
Phase thickness (μm) 0.25
Program 40 0C 3 K/min -> 175 0C 15 K/min -> 240 0C (10 min)
I 1579.
Referenceda Silva, Pedro, et al., 2000
Comment MSDC-RI

Van Den Dool and Kratz RI, non-polar column, custom temperature program

Data compiled by: NIST Mass Spectrometry Data Center, William E. Wallace, director

Column type CapillaryCapillaryCapillary
Active phase BPX-5CP Sil 8 CBBP-1
Column length (m) 30.50.50.
Carrier gas  He
Substrate
Column diameter (mm) 0.250.320.22
Phase thickness (μm) 0.25 0.25
Program 35C(5min) => 3C/min => 210C => 40C/min => 240C (4min)60C (2min) => 5C/min => 160C (1min) => 10C/min => 250C (2min)not specified
I 1635.1606.1601.
ReferenceCardeal, da Silva, et al., 2006Mockute and Judzentiene, 2003Cavalli, Ranarivelo, et al., 2001
Comment MSDC-RI MSDC-RI MSDC-RI

References

Paolini, Tomi, et al., 2008
Paolini, J.; Tomi, P.; Bernardini, A.-F.; Bradesi, P.; Casanova, J.; Kaloustian, J., Detailed analysis of the essential oil from Cistus albidus L. by combination of GC/RI, GC/MS and 13C-NMR spectroscopy, N.Z. J. Agric. Res., 2008, 22, 14, 1270-1278. [all data]

Limberger, Scopel, et al., 2007
Limberger, R.P.; Scopel, M.; Sobral, M.; Henriques, A.T., Comparative analysis of volatiles from Drimys brasiliensis Miers and D. angustifolia Miers (Winteraceae) from Southern Brazil, Biochem. Syst. Ecol., 2007, 35, 3, 130-137, https://doi.org/10.1016/j.bse.2006.09.007 . [all data]

Singh, Kumar, et al., 2007
Singh, B.; Kumar, R.; Bhandari, S.; Pathania, S.; Lal, B., Volatile constituents of natural Boswellia serrata oleo-gum-resin and commercial samples, Flavour Fragr. J., 2007, 22, 2, 145-147, https://doi.org/10.1002/ffj.1772 . [all data]

Choi, 2006
Choi, H.-S., Headspace analyses of fresh leaves and stems of Angelica gigas Nakai, a Korean medicinal herb, Flavour Fragr. J., 2006, 21, 4, 604-608, https://doi.org/10.1002/ffj.1602 . [all data]

Lee, Umano, et al., 2005
Lee, S.-J.; Umano, K.; Shibamoto, T.; Lee, K.-G., Identification of volatile components in basil (Ocimum basilicum L.) and thyme leaves (Thymus vulgaris L.) and their antioxidant properties, Food Chem., 2005, 91, 1, 131-137, https://doi.org/10.1016/j.foodchem.2004.05.056 . [all data]

Umano, Hagi, et al., 2000
Umano, K.; Hagi, Y.; Nakahara, K.; Shoji, A.; Shibamoto, T., Volatile chemicals identified in extracts from leaves of Japanese mugwort (Artemisia princeps Pamp.), J. Agric. Food Chem., 2000, 48, 8, 3463-3469, https://doi.org/10.1021/jf0001738 . [all data]

Ajaiyeoba and Ekundayo, 1999
Ajaiyeoba, E.O.; Ekundayo, O., Essential oil constituents of Aframomum melegueta (Roscoe) K. Schum. seeds (alligator pepper) from Nigeria, Flavour Fragr. J., 1999, 14, 2, 109-111, https://doi.org/10.1002/(SICI)1099-1026(199903/04)14:2<109::AID-FFJ775>3.0.CO;2-M . [all data]

Ngassoum, Yonkeu, et al., 1999
Ngassoum, M.B.; Yonkeu, S.; Jirovetz, L.; Buchbauer, G.; Schmaus, G.; Hammerschmidt, F.-J.H., Chemical composition of essential oils of Lantana camara leaves and flowers from Cameroon and Madagascar, Flavour Fragr. J., 1999, 14, 4, 245-250, https://doi.org/10.1002/(SICI)1099-1026(199907/08)14:4<245::AID-FFJ819>3.0.CO;2-X . [all data]

Malizia, Molli, et al., 1996
Malizia, R.A.; Molli, J.S.; Cardell, D.A.; Retamar, J.A., Volatile constituents of the essential oil of Nepeta cataria L. grown in Cordoba Province (Argentina), J. Essent. Oil Res., 1996, 8, 5, 565-567, https://doi.org/10.1080/10412905.1996.9700691 . [all data]