2,3,8-Trichloro-dibenzothiophene

Van Den Dool and Kratz RI, non-polar column, temperature ramp

View large format table.

Column type Active phase I Reference Comment
CapillaryDB-52401.Sielex and Andersson, 200025. m/0.25 mm/0.25 μm, H2, 80. C @ 2. min, 15. K/min, 295. C @ 1. min

References

Sielex and Andersson, 2000
Sielex, K.; Andersson, J.T., Prediction of gas chromatographic retention indices of polychlorinated dibenzothiophenes on non-polar columns, J. Chromatogr. A, 2000, 866, 1, 105-120, https://doi.org/10.1016/S0021-9673(99)01079-1 . [all data]