1,3,6-Trichloro-dibenzothiophene

Van Den Dool and Kratz RI, non-polar column, temperature ramp

Data compiled by: NIST Mass Spectrometry Data Center, William E. Wallace, director

Column type Capillary
Active phase DB-5
Column length (m) 25.
Carrier gas H2
Substrate
Column diameter (mm) 0.25
Phase thickness (μm) 0.25
Tstart (C) 80.
Tend (C) 295.
Heat rate (K/min) 15.
Initial hold (min) 2.
Final hold (min) 1.
I 2318.
ReferenceSielex and Andersson, 2000
Comment MSDC-RI

References

Sielex and Andersson, 2000
Sielex, K.; Andersson, J.T., Prediction of gas chromatographic retention indices of polychlorinated dibenzothiophenes on non-polar columns, J. Chromatogr. A, 2000, 866, 1, 105-120, https://doi.org/10.1016/S0021-9673(99)01079-1 . [all data]