(Z)-3-Hexenyl tiglate

Van Den Dool and Kratz RI, non-polar column, temperature ramp

Data compiled by: NIST Mass Spectrometry Data Center, William E. Wallace, director

Column type Capillary
Active phase HP-5
Column length (m) 30.
Carrier gas
Substrate
Column diameter (mm) 0.32
Phase thickness (μm) 0.25
Tstart (C) 40.
Tend (C) 280.
Heat rate (K/min) 3.
Initial hold (min) 4.
Final hold (min)
I 1322.
ReferenceRuther, 2000
Comment MSDC-RI

References

Ruther, 2000
Ruther, J., Retention index database for identification of general green leaf volatiles in plants coupled capillary gas chromatography-mass spectrometry, J. Chromatogr. A, 2000, 890, 2, 313-319, https://doi.org/10.1016/S0021-9673(00)00618-X . [all data]