1-Butanamine, 3-methyl, N-(1-methylethyl)

Kovats' RI, non-polar column, isothermal

Data compiled by: NIST Mass Spectrometry Data Center, William E. Wallace, director

Column type Packed
Active phase Apiezon L
Column length (m) 2.7
Carrier gas
Substrate Chromosorb G AW (80-100 mesh)
Column diameter (mm)
Phase thickness (μm)
Temperature (C) 100.
I 853.
ReferenceGolovnya, Zhuravleva, et al., 1982
Comment MSDC-RI

References

Golovnya, Zhuravleva, et al., 1982
Golovnya, R.V.; Zhuravleva, I.L.; Svetlova, I.; Terenina, M.B.; Gutnik, S.B., Calculation of gas chromatographic retention indices of secondary amines from structural increments, Zh. Anal. Khim., 1982, 37, 294-300. [all data]