Pinocarvyl acetate

Normal alkane RI, polar column, temperature ramp

Data compiled by: NIST Mass Spectrometry Data Center, William E. Wallace, director

Column type Capillary
Active phase Stabilwax
Column length (m) 30.
Carrier gas H2
Substrate
Column diameter (mm) 0.32
Phase thickness (μm) 0.25
Tstart (C) 60.
Tend (C) 280.
Heat rate (K/min) 10.
Initial hold (min) 5.
Final hold (min) 5.
I 1681.
ReferenceJirovetz L., Buchbauer G., et al., 2001
Comment MSDC-RI

Van Den Dool and Kratz RI, non-polar column, custom temperature program

Data compiled by: NIST Mass Spectrometry Data Center, William E. Wallace, director

Column type Capillary
Active phase SE-52
Column length (m) 25.
Carrier gas He
Substrate
Column diameter (mm) 0.25
Phase thickness (μm) 0.25
Program 60C(8min) => 3C/min => 180C => 20C/min => 230C
I 1309.
ReferenceLorenzo, Loayza, et al., 2003
Comment MSDC-RI

References

Jirovetz L., Buchbauer G., et al., 2001
Jirovetz L.; Buchbauer G.; Shafi P.M.; Rosamma M.K.; Geissler M., Analysis of the composition and aroma of the essential leaf oil of Syzygium travancoricum from South India by GC-FID, GC-MS, and olfactometry. Seasonal changes of composition, Chromatographia Sup., 2001, 53, S1, s372-s374, https://doi.org/10.1007/BF02490359 . [all data]