Fluvoxamine (ketone)

Kovats' RI, non-polar column, temperature ramp

View large format table.

Column type Active phase I Reference Comment
CapillaryHP-11525.Maurer and Bickeboeller-Friedrich, 200012. m/0.20 mm/0.33 μm, He, 100. C @ 3. min, 30. K/min, 310. C @ 8. min

References

Maurer and Bickeboeller-Friedrich, 2000
Maurer, H.H.; Bickeboeller-Friedrich, J., Screening procedure for detection of antidepressants of the selective serotonin reuptake inhibitor type and their metabolites in urine as part of a modified systematic toxicological analysis procedure using gas chromatography-mass spectrometry, J. Anal. Toxicol., 2000, 24, 5, 340-347, https://doi.org/10.1093/jat/24.5.340 . [all data]