Kaur-16-en-19-al

Normal alkane RI, non-polar column, custom temperature program

View large format table.

Column type Active phase I Reference Comment
CapillaryHP-52361.Aparicio, Romero, et al., 200130. m/0.25 mm/0.25 μm; Program: not specified
CapillaryHP-52330.Usubillaga, Aparicio, et al., 200130. m/0.25 mm/0.25 μm, He; Program: 50 0C 3 K/min -> 200 0C 8 K/min -> 280 0C

References

Aparicio, Romero, et al., 2001
Aparicio, R.; Romero, M.; Rojas, L.B.; Khouri, N.; Usubillaga, A., Composition of the essential oil of four species of Ruilopezia from the Venezuelan Andes, Flavour Fragr. J., 2001, 16, 3, 172-174, https://doi.org/10.1002/ffj.973 . [all data]

Usubillaga, Aparicio, et al., 2001
Usubillaga, A.; Aparicio, R.; Romero, M.; Rojas, L.B.; Khouri, N., Volatile constituents from the leaves of four Libanothamus species from the Venezuelan Andes, Flavour Fragr. J., 2001, 16, 3, 209-211, https://doi.org/10.1002/ffj.981 . [all data]