6,7-Epoxymyrcene

Normal alkane RI, non-polar column, temperature ramp

Data compiled by: NIST Mass Spectrometry Data Center, William E. Wallace, director

Column type Capillary
Active phase DB-5
Column length (m) 30.
Carrier gas Helium
Substrate
Column diameter (mm) 0.32
Phase thickness (μm) 0.25
Tstart (C) 60.
Tend (C) 280.
Heat rate (K/min) 3.
Initial hold (min)
Final hold (min)
I 1088.
ReferenceGeorgiou, Koutsaviti, et al., 2010
Comment MSDC-RI

References

Georgiou, Koutsaviti, et al., 2010
Georgiou, C.; Koutsaviti, A.; Bazos, I.; Tzakou, O., Chemical composition of Echinophora tenuifolia subsp. sibthorpiana essential oil from Greece, Rec. Nat. Prod., 2010, 4, 3, 167-170. [all data]