3,11-Dimethyltricosane

Van Den Dool and Kratz RI, non-polar column, temperature ramp

View large format table.

Column type Active phase I Reference Comment
CapillaryDB-5MS2405.Steinmetz, Schmolz, et al., 200330. m/0.32 mm/0.25 μm, He, 3. K/min; Tstart: 150. C; Tend: 280. C

Normal alkane RI, non-polar column, temperature ramp

View large format table.

Column type Active phase I Reference Comment
CapillaryDB-12405.Katritzky, Chen, et al., 200030. m/0.32 mm/0.25 μm; Tstart: 60. C; Tend: 320. C
CapillaryHP-12410.Haverty, Page, et al., 1991Helium, 3. K/min, 320. C @ 20. min; Column length: 30. m; Column diameter: 0.20 mm; Tstart: 150. C

References

Steinmetz, Schmolz, et al., 2003
Steinmetz, I.; Schmolz, E.; Ruther, J., Cuticular lipids as trail pheromone in a social wasp, Proc. R. Soc. London B:, 2003, 270, 1513, 385-391, https://doi.org/10.1098/rspb.2002.2256 . [all data]

Katritzky, Chen, et al., 2000
Katritzky, A.R.; Chen, K.; Maran, U.; Carlson, D.A., QSPR Correlation and predictions of GC retention indexes for methyl-branched hydrocarbons produced by insects, Anal. Chem., 2000, 72, 1, 101-109, https://doi.org/10.1021/ac990800w . [all data]

Haverty, Page, et al., 1991
Haverty, M.I.; Page, M.; Thorne, B.L.; Escoubas, P., Cuticular hydrocarbons: species and population-level discrimination in termites, USDA Forest Service Gen. Tech. Report PSW-128, The Forest Service, U.S.Department of Agriculture, 1991, 52. [all data]