Hexacosane, 4,10-dimethyl

Van Den Dool and Kratz RI, non-polar column, temperature ramp

View large format table.

Column type Active phase I Reference Comment
CapillaryDB-5MS2687.Steinmetz, Schmolz, et al., 200330. m/0.32 mm/0.25 μm, He, 3. K/min; Tstart: 150. C; Tend: 280. C

Normal alkane RI, non-polar column, temperature ramp

View large format table.

Column type Active phase I Reference Comment
CapillaryDB-12692.5Katritzky, Chen, et al., 200030. m/0.32 mm/0.25 μm; Tstart: 60. C; Tend: 320. C

References

Steinmetz, Schmolz, et al., 2003
Steinmetz, I.; Schmolz, E.; Ruther, J., Cuticular lipids as trail pheromone in a social wasp, Proc. R. Soc. London B:, 2003, 270, 1513, 385-391, https://doi.org/10.1098/rspb.2002.2256 . [all data]

Katritzky, Chen, et al., 2000
Katritzky, A.R.; Chen, K.; Maran, U.; Carlson, D.A., QSPR Correlation and predictions of GC retention indexes for methyl-branched hydrocarbons produced by insects, Anal. Chem., 2000, 72, 1, 101-109, https://doi.org/10.1021/ac990800w . [all data]