2H-Thiapyrane, 2-methyl

Van Den Dool and Kratz RI, non-polar column, custom temperature program

Data compiled by: NIST Mass Spectrometry Data Center, William E. Wallace, director

Column type Capillary
Active phase CP Sil 8 CB
Column length (m) 60.
Carrier gas
Substrate
Column diameter (mm) 0.25
Phase thickness (μm) 0.25
Program not specified
I 915.
ReferenceElmore and Mottram, 2000
Comment MSDC-RI

References

Elmore and Mottram, 2000
Elmore, J.S.; Mottram, D.S., Formation of 2-alkyl-(2H)-thiapyrans and 2-Alkylthiophenes in cooked beef and lamb, J. Agric. Food Chem., 2000, 48, 6, 2420-2424, https://doi.org/10.1021/jf000124v . [all data]